[Slackbuilds-users] encfs-1.5 problem
toccalenuvole
toccalenuvole73 at yahoo.it
Thu Mar 25 23:49:39 UTC 2010
Hello, I'm running slackware-current on my netbook aspire D250. I
installed all the dependencies, but I can't compile encfs-1.5:
...
NameIO.cpp:193: error: invalid conversion from 'const char*' to 'char*'
make[2]: *** [NameIO.lo] Error 1
make[2]: Leaving directory `/tmp/SBo/encfs-1.5/encfs'
make[1]: *** [all-recursive] Error 1
make[1]: Leaving directory `/tmp/SBo/encfs-1.5'
make: *** [all] Error 2
did I make anything wrong?
Thanks
--
Toccalenuvole on linux slack
nel mondo fluttuante
More information about the SlackBuilds-users
mailing list