[Slackbuilds-users] Error when building evas

Fakhry fakhry.linux at gmail.com
Mon Dec 19 11:18:39 UTC 2011

I want to build enlightenment (0.16.999.65643) with buld order is: eina,
embryo, eet, evas, ecore, edje,
e_dbus, efreet, eeze, enlightenment.
When building evas i've got an error like this:

evas_engine.c:493:4: warning: assignment from incompatible pointer type
  CC     module_la-evas_x_main.lo
  CCLD   module.la
/usr/lib/libX11.so: could not read symbols: File in wrong format
collect2: ld returned 1 exit status
make[5]: *** [module.la] Error 1
make[5]: Leaving directory `/tmp/SBo/evas-1.1.0/src/modules/engines/gl_x11'
make[4]: *** [all-recursive] Error 1
make[4]: Leaving directory `/tmp/SBo/evas-1.1.0/src/modules/engines'
make[3]: *** [all-recursive] Error 1
make[3]: Leaving directory `/tmp/SBo/evas-1.1.0/src/modules'
make[2]: *** [all-recursive] Error 1
make[2]: Leaving directory `/tmp/SBo/evas-1.1.0/src'
make[1]: *** [all-recursive] Error 1
make[1]: Leaving directory `/tmp/SBo/evas-1.1.0'
make: *** [all] Error 2

Any suggest?

PS: Sorry if my English is bad
Muhammad Fakhry
-------------- next part --------------
An HTML attachment was scrubbed...
URL: <http://lists.slackbuilds.org/pipermail/slackbuilds-users/attachments/20111219/80dc4991/attachment.html>

More information about the SlackBuilds-users mailing list