[Slackbuilds-users] liblrdf build failure (14.0 x86_64)

Josiah Boothby josiahb at gmail.com
Mon Oct 8 21:47:25 UTC 2012

I'm trying to build liblrdf as a dependency for rosegarden and get the
error below. Thinking it might possibly be a multilib issue, I added
the line suggested in the SBo FAQ. I tried the most recent liblrdf
from git. The error message is the same (excepting the path names). It
looks a little to me like I'm missing a dependency, but I don't know
what it might be.

cannot find -licuuc
collect2: error: ld returned 1 exit status
make[2]: *** [liblrdf.la] Error 1
make[2]: Leaving directory `/tmp/SBo/swh-LRDF-7ebc032/src'
make[1]: *** [all-recursive] Error 1
make[1]: Leaving directory `/tmp/SBo/swh-LRDF-7ebc032'
make: *** [all] Error 2

More information about the SlackBuilds-users mailing list