[Slackbuilds-users] oathtool package.

Fernando Lopez fernando.lopezjr at gmail.com
Mon Oct 16 17:07:01 UTC 2017

trying to make a package for oathtool, but it breaks... do i need
additional dependencies?

according to this website, there are some required tools:
maybe i just need a dep or it is just broken... =\

i think that the code i just broken.

make[3]: Leaving directory '/tmp/SBo/oath-toolkit-2.6.2/liboath'
make[2]: Leaving directory '/tmp/SBo/oath-toolkit-2.6.2/liboath'
Making all in oathtool
make[2]: Entering directory '/tmp/SBo/oath-toolkit-2.6.2/oathtool'
make  all-recursive
make[3]: Entering directory '/tmp/SBo/oath-toolkit-2.6.2/oathtool'
Making all in gl
make[4]: Entering directory '/tmp/SBo/oath-toolkit-2.6.2/oathtool/gl'
  GEN      alloca.h
  GEN      c++defs.h
  GEN      warn-on-use.h
  GEN      arg-nonnull.h
  GEN      inttypes.h
  GEN      stdio.h
  GEN      stdlib.h
  GEN      string.h
  GEN      sys/time.h
  GEN      sys/types.h
  GEN      time.h
  GEN      unistd.h
  GEN      wchar.h
make  all-recursive
make[5]: Entering directory '/tmp/SBo/oath-toolkit-2.6.2/oathtool/gl'
Making all in tests
make[6]: Entering directory '/tmp/SBo/oath-toolkit-2.6.2/oathtool/gl/tests'
  GEN      c++defs.h
  GEN      warn-on-use.h
  GEN      ctype.h
  GEN      arg-nonnull.h
make  all-recursive
make[7]: Entering directory '/tmp/SBo/oath-toolkit-2.6.2/oathtool/gl/tests'
Making all in .
make[8]: Entering directory '/tmp/SBo/oath-toolkit-2.6.2/oathtool/gl/tests'
make[8]: Nothing to be done for 'all-am'.
make[8]: Leaving directory '/tmp/SBo/oath-toolkit-2.6.2/oathtool/gl/tests'
make[7]: Leaving directory '/tmp/SBo/oath-toolkit-2.6.2/oathtool/gl/tests'
make[6]: Leaving directory '/tmp/SBo/oath-toolkit-2.6.2/oathtool/gl/tests'
make[6]: Entering directory '/tmp/SBo/oath-toolkit-2.6.2/oathtool/gl'
  CC       c-ctype.lo
  CC       exitfail.lo
  CC       gettime.lo
  CC       malloca.lo
  CC       parse-datetime.lo
In file included from ./parse-datetime.y:37:0:
intprops.h:234:34: error: expected ')' before '(' token
    __builtin_add_overflow (a, b, (__typeof__ ((a) + (b)) *) 0)
make[6]: *** [Makefile:1218: parse-datetime.lo] Error 1
make[6]: Leaving directory '/tmp/SBo/oath-toolkit-2.6.2/oathtool/gl'
make[5]: *** [Makefile:1240: all-recursive] Error 1
make[5]: Leaving directory '/tmp/SBo/oath-toolkit-2.6.2/oathtool/gl'
make[4]: *** [Makefile:1109: all] Error 2
make[4]: Leaving directory '/tmp/SBo/oath-toolkit-2.6.2/oathtool/gl'
make[3]: *** [Makefile:1302: all-recursive] Error 1
make[3]: Leaving directory '/tmp/SBo/oath-toolkit-2.6.2/oathtool'
make[2]: *** [Makefile:1085: all] Error 2
make[2]: Leaving directory '/tmp/SBo/oath-toolkit-2.6.2/oathtool'
make[1]: *** [Makefile:391: all-recursive] Error 1
make[1]: Leaving directory '/tmp/SBo/oath-toolkit-2.6.2'
make: *** [Makefile:346: all] Error 2


    Fernando Lopez Jr.
-------------- next part --------------
An HTML attachment was scrubbed...
URL: <http://lists.slackbuilds.org/pipermail/slackbuilds-users/attachments/20171016/929bdbda/attachment-0001.html>

More information about the SlackBuilds-users mailing list