[Slackbuilds-users] OpenCASCADE build issue

Tim Dickson dickson.tim at googlemail.com
Tue Jun 20 21:39:41 UTC 2023

Hi all, I'm getting build failure with the error

[100%] Linking CXX executable ../../lin64/gcc/bin/DRAWEXE
/usr/bin/ld: /usr/lib64/libldb.so.2: undefined reference to 
`rep_memset_s at SAMBA_4.15.13'
collect2: error: ld returned 1 exit status
make[2]: *** [src/DRAWEXE/CMakeFiles/DRAWEXE.dir/build.make:118: 
lin64/gcc/bin/DRAWEXE-7.7.0] Error 1
make[1]: *** [CMakeFiles/Makefile2:3747: 
src/DRAWEXE/CMakeFiles/DRAWEXE.dir/all] Error 2
make: *** [Makefile:136: all] Error 2

I am using the following build flags/options

( VTK was built with IMAGING=yes MPI=yes )

any ideas?
regards, Tim

More information about the SlackBuilds-users mailing list