[Slackbuilds-users] Compilation of Virtual box 3.1.6

Arbit Arbit max.arbit at gmail.com
Wed Aug 18 02:56:35 UTC 2010


I am trying to use the slackbuild available for Virtual box 3.1.6 on
my Slackware 13.0. (I did try the latest version of Virtual Box -
3.2.6, but could not get it started somehow, so trying the version
available for Slack 13.0). The compilation errors out with the
following message -

/tmp/SBo/VirtualBox-3.1.6_OSE/src/VBox/Devices/PC/vbox.dsl  1076:
                0xdfdfffff,              // Range Length (calculated
Error    4118 -                                     Length is not
equal to fixed Min/Max window ^

ASL Input:  /tmp/SBo/VirtualBox-3.1.6_OSE/src/VBox/Devices/PC/vbox.dsl
- 1446 lines, 50791 bytes, 299 keywords
Compilation complete. 1 Errors, 0 Warnings, 0 Remarks, 403 Optimizations
kmk[2]: *** [/tmp/SBo/VirtualBox-3.1.6_OSE/out/linux.x86/release/obj/DevicesR3/vboxaml.hex]
Error 255
kmk[2]: *** Deleting file
kmk[2]: *** Waiting for unfinished jobs....
kmk[2]: Leaving directory `/tmp/SBo/VirtualBox-3.1.6_OSE'
kmk[2]: Entering directory `/tmp/SBo/VirtualBox-3.1.6_OSE'
kmk[2]: *** Exiting with status 2
kmk[1]: *** [pass_libraries_this] Error 2
kmk[1]: Leaving directory `/tmp/SBo/VirtualBox-3.1.6_OSE'
kmk: *** [pass_libraries_order] Error 2

Any suggestions on what I might be doing wrong?


More information about the SlackBuilds-users mailing list