[Slackbuilds-users] Error Building postgis-1.4.0 on -13.1/32-bit

Rich Shepard rshepard at appl-ecosys.com
Tue Jul 26 23:44:44 UTC 2011

   Probably user error in the configuration (I went with the default), but
this is what I see when I try to build postgis-1.4.0:

gcc -O2 -Wall -Wmissing-prototypes -Wpointer-arith
-Wdeclaration-after-statement -Wendif-labels -fno-strict-aliasing -fwrapv
-fpic -I/usr/include  -I../liblwgeom -I. -I.
-I/usr/local/pgsql/include/server -I/usr/local/pgsql/include/internal
-D_GNU_SOURCE   -c -o lwgeom_accum.o lwgeom_accum.c
lwgeom_accum.c: In function 'pgis_geometry_accum_transfn':
lwgeom_accum.c:110: error: 'WindowAggState' has no member named 'wincontext'
make[1]: *** [lwgeom_accum.o] Error 1
make[1]: Leaving directory /tmp/SBo/postgis-1.4.0/postgis'
make: *** [postgis] Error 2

   Guidance on what to do to build this package is appreciated.


More information about the SlackBuilds-users mailing list