[Slackbuilds-users] Satus Update

Binh Nguyen bnguyen at gmx.com
Mon Sep 17 03:38:10 UTC 2012

On Sun, 16 Sep 2012 22:02:26 -0500
Robby Workman <rworkman at slackbuilds.org> wrote:

> On Sun, 16 Sep 2012 18:54:42 -0700
> Larry Hajali <larryhaja at gmail.com> wrote:
> > pasang-emas - compiles and runs fine on Slackware64 -current
> I removed it from Checklist, but you probably want to make sure
> on this one - here's what David's error log shows:
> gcc  -O2 -fPIC   -o pasang-emas brain.o brainsetter.o client.o
> game-view.o pasang-emas.o pattern.o pattern-editor.o
> pattern-selector.o theme.o theme-2d.o theme-2d-cairo.o
> theme-2d-file.o window.o libpasang.a -pthread -lgtk-x11-2.0
> -lgdk-x11-2.0 -latk-1.0 -lgio-2.0 -lpangoft2-1.0 -lpa ngocairo-1.0
> -lgdk_pixbuf-2.0 -lcairo -lpango-1.0 -lfreetype -lfontconfig
> -lgobject-2.0 -lgthread-2.0 -lrt
> -lglib-2.0 /usr/lib64/gcc/x86_64-slackware-linux/4.7.1/../../../../x86_64-slackware-linux/bin/ld:
> theme-2d-cairo.o: undefined reference to symbol 'hypot@
> @GLIBC_2.2.5' /usr/lib64/gcc/x86_64-slackware-linux/4.7.1/../../../../x86_64-slackware-linux/bin/ld:
> note: 'hypot@@GLIBC_2.2.5' is defined in DSO /lib64/lib m.so.6 so try
> adding it to the linker command line /lib64/libm.so.6: could not read
> symbols: Invalid operation collect2: error: ld returned 1 exit status
> make[2]: *** [pasang-emas] Error 1 make[2]: Leaving directory
> `/tmp/sbopkg.cbzNvR/pasang-emas-3.1.0/src' make[1]: ***
> [all-recursive] Error 1 make[1]: Leaving directory
> `/tmp/sbopkg.cbzNvR/pasang-emas-3.1.0' make: *** [all] Error 2

First I thought this has the same issue as gtorrentviewer (built on
32-bit but not on 64-bit or vice versa). But no, I tested it and it has
the underlinking issue on both archs.

Larry, maybe you didn't use the latest -current?


More information about the SlackBuilds-users mailing list