[Slackbuilds-users] [ERR] Can't build ledger

Xavier Maillard xavier at maillard.im
Mon Feb 23 12:42:10 UTC 2015


I see ledger is now at 3.1 in SBo but when I try to build/install it,
I got this error:

-- Build files have been written to: /tmp/SBo/ledger-3.1
[  1%] Generating ../system.hh.gch
/tmp/SBo/ledger-3.1/system.hh:162:18: fatal error: utf8.h: No such
file or directory
compilation terminated.
make[2]: *** [system.hh.gch] Error 1
make[1]: *** [src/CMakeFiles/libledger.dir/all] Error 2
make: *** [all] Error 2
acprep: ERROR: Execution failed: make

Would you like to continue processing the rest of the
queue or would you like to abort?  If this failed
package is a dependency of another package in the queue
then it may not make sense to continue.

Does anybody know where the missing file is part of ?


-- Xavier.
-------------- next part --------------
A non-text attachment was scrubbed...
Name: not available
Type: application/pgp-signature
Size: 1529 bytes
Desc: not available
URL: <http://lists.slackbuilds.org/pipermail/slackbuilds-users/attachments/20150223/d4e97aff/attachment-0001.asc>

More information about the SlackBuilds-users mailing list