[Slackbuilds-users] audacity not compiling =|

Fernando Lopez fernando.lopezjr at gmail.com
Thu Oct 15 16:57:33 UTC 2015

X11.so /usr/lib64/libxcb.so /usr/lib64/libXau.so /usr/lib64/libXdmcp.so
/usr/lib64/libdrm.so /usr/lib64/libgdk_pixbuf-2.0.so /usr/lib64/
libgio-2.0.so -lresolv /usr/lib64/libpangoft2-1.0.so /usr/lib64/
libpango-1.0.so /usr/lib64/libgmodule-2.0.so /usr/lib64/libgthread-2.0.so
/usr/lib64/libgobject-2.0.so /usr/lib64/../lib64/libffi.so
/usr/lib64/libfontconfig.so /usr/lib/libfreetype.so /usr/lib/libexpat.so
/usr/lib64/libexpat.so /usr/lib64/libharfbuzz.so /usr/lib64/libglib-2.0.so
/usr/lib64/libfreetype.so /usr/lib/libpng16.so -lbz2 /usr/lib64/libpng16.so
-lz /usr/lib64/libasound.so -lm -ldl -lpthread /usr/lib64/libudev.so -lrt
-pthread -Wl,-rpath -Wl,/usr/lib64/../lib64 -Wl,-rpath
/usr/lib/libXext.so: error adding symbols: File in wrong format
collect2: error: ld returned 1 exit status
make[2]: *** [audacity] Error 1
make[2]: Leaving directory `/tmp/SBo/audacity-src-2.1.0/src'
make[1]: *** [all] Error 2
make[1]: Leaving directory `/tmp/SBo/audacity-src-2.1.0/src'
make: *** [all-recursive] Error 1

Would you like to continue processing the rest of the
queue or would you like to abort?  If this failed
package is a dependency of another package in the queue
then it may not make sense to continue.

(Y)es to continue, (N)o to abort, (R)etry the build?:


    Fernando Lopez Jr.
-------------- next part --------------
An HTML attachment was scrubbed...
URL: <http://lists.slackbuilds.org/pipermail/slackbuilds-users/attachments/20151015/cef78b95/attachment.html>

More information about the SlackBuilds-users mailing list