[Slackbuilds-users] Build Errors: qgis-2.10.1

Rich Shepard rshepard at appl-ecosys.com
Sat Sep 19 14:40:49 UTC 2015

   I tried (three times) to build qgis-2.10.1 in order to upgrade from
-2.4.0. But, there are errors that I don't think I can fix here. A week ago
I wrote the maintainer but have not received a response.

   Dependencies -- at least for the 2.4.0 version -- are installed as that
was built using the SlackBuilds script. If prerequisite libraries needed
updating, sbopkg would have picked them up.

   The last few errors and the results:

undefined reference to `QsciScintilla::findFirst(QString const&, bool, bool,
bool, bool, bool, int, int, bool, bool)'
undefined reference to `QsciScintilla::replaceSelectedText(QString const&)'
undefined reference to `QsciScintilla::setAutoCompletionUseSingle(QsciScintilla::AutoCompletionUseSingle)'
collect2: error: ld returned 1 exit status
make[2]: *** [output/lib/libqgis_gui.so.2.10.1] Error 1
make[2]: Leaving directory /tmp/SBo/qgis-2.10.1'
make[1]: *** [src/gui/CMakeFiles/qgis_gui.dir/all] Error 2
make[1]: Leaving directory /tmp/SBo/qgis-2.10.1'
make: *** [all] Error 2

   Can you suggest how to fix these errors?



More information about the SlackBuilds-users mailing list