[Slackbuilds-users] Texlive-2016 build error.

Ananda Murthy R S rsamurti at gmail.com
Sun Jul 24 08:14:36 UTC 2016


I am trying to build
on Slackware Current of 24-July-2016.

But I got this error after some time:

libmplib.a(libmplib_a-pngout.o): undefined reference to symbol
/usr/lib64/libpng16.so.16: error adding symbols: DSO missing from command
collect2: error: ld returned 1 exit status
Makefile:5057: recipe for target 'mpost' failed
make[5]: *** [mpost] Error 1
make[5]: Leaving directory
Makefile:13447: recipe for target 'all-recursive' failed
make[4]: *** [all-recursive] Error 1
make[4]: Leaving directory
Makefile:3820: recipe for target 'all' failed
make[3]: *** [all] Error 2
make[3]: Leaving directory
Makefile:901: recipe for target 'recurse' failed
make[2]: *** [recurse] Error 1
make[2]: Leaving directory '/tmp/SBo/texlive-20160523-source/build/texk'
Makefile:481: recipe for target 'all-recursive' failed
make[1]: *** [all-recursive] Error 1
make[1]: Leaving directory '/tmp/SBo/texlive-20160523-source/build/texk'
Makefile:569: recipe for target 'all-recursive' failed
make: *** [all-recursive] Error 1

The error appears to be related to metapost?

Can you please help.

Thank you for your help.


Close Windows ! Open source !!
Free software from proprietary mafia !!!
-------------- next part --------------
An HTML attachment was scrubbed...
URL: <http://lists.slackbuilds.org/pipermail/slackbuilds-users/attachments/20160724/3074b4c0/attachment.html>

More information about the SlackBuilds-users mailing list