[Slackbuilds-users] qt5 5.5.1 fails to build with multiple jobs

Andrzej Telszewski atelszewski at gmail.com
Sun Mar 13 09:00:16 UTC 2016


I'm on Slackware-current and SBo master.

I'm trying to build qt5 and it fails with the following error:

[6/10258] CXX 
ninja: build stopped: subcommand failed.
Makefile.gyp_run:766: recipe for target 'invoke_ninja' failed
make[4]: *** [invoke_ninja] Error 1
make[4]: Leaving directory 
Makefile:63: recipe for target 'sub-gyp_run-pro-make_first' failed
make[3]: *** [sub-gyp_run-pro-make_first] Error 2
make[3]: Leaving directory 
Makefile:48: recipe for target 'sub-core-make_first' failed
make[2]: *** [sub-core-make_first] Error 2
make[2]: Leaving directory 
Makefile:44: recipe for target 'sub-src-make_first' failed
make[1]: *** [sub-src-make_first] Error 2
make[1]: Leaving directory 
Makefile:803: recipe for target 'module-qtwebengine-make_first' failed
make: *** [module-qtwebengine-make_first] Error 2
make: *** Waiting for unfinished jobs....

Please note that it's most certainly not the exact place where the build 
failed for the first time, as I tried single job make in the leftover 
source tree.

Single job make seems to resume the build (it's ongoing at the moment).

Any ideas on what might be the problem?

It looks like ninja is only used for the build of chromium, but I might 
be wrong on that.

Best regards,
Andrzej Telszewski

More information about the SlackBuilds-users mailing list