[Slackbuilds-users] icecat

Ivan Zaigralin melikamp at melikamp.com
Thu Apr 27 21:02:28 UTC 2017

I don't know what's wrong here. I don't even test the build script on a x32 
system, I suppose SlackBuilds do before they post it. I am sure no one tests 
it in multilib presence, so you might be a pioneer on this.

If you find a workaround, please let me know.

In the meanwhile, since you are able to run 64 bit binaries, feel welcome to 
get a binary build here:


On Thursday, April 27, 2017 22:57:30 you wrote:
> I tried to build icecat on slackware64 14.2 but with multilib enabled and in
> the 32 bit environment following alienBOB guidelines. It resulted in a
> failure after some hours of run with the following error I manually copied
> below.
> /tmp/SBo/icecat-45.7.0/obj/_virtualenv/bin/python
> /tmp/SBo/icecat-45.7.0/configexpandlibs_gen.py -o libdom_bindings.a.desc
> PrototypeList.o RegisterBindings.o RegisterWorkerBindings.o
> ResolveSystemBinding.o UnionTypes.o UnifiedBindings0.o  UnifiedBindings1.o
> UnifiedBindings10.o UnifiedBindings11.o UnifiedBindings12.o
> UnifiedBindings13.o UnifiedBindings14.o UnifiedBindings15.o
> UnifiedBindings16.o UnifiedBindings17.o UnifiedBindings18.o
> UnifiedBindings19.o UnifiedBindings2.o UnifiedBindings20.o
> UnifiedBindings21.o UnifiedBindings22.o UnifiedBindings23.o
> UnifiedBindings24.o UnifiedBindings3.o UnifiedBindings4.o UnifiedBindings5.o
> UnifiedBindings6.o UnifiedBindings7.o UnifiedBindings8.o UnifiedBindings9.o
> StructuredClone.o Unified_cpp_dom_bindings0.o
> make[5]: Leaving directory '/tmp/SBo/icecat-45.7.0/obj/dom/bindings'
> make[4]: Leaving directory '/tmp/SBo/icecat-45.7.0/obj'
> /tmp/SBo/icecat-45.7.0/config/recurse.mk:32: recipe for target 'compile'
> failed
> make[3]: *** [compile] Error 2
> make[3]: Leaving directory '/tmp/SBo/icecat-45.7.0/obj'
> /tmp/SBo/icecat-45.7.0/config/rules.mk:547: recipe for target 'default'
> failed
> make[2]: *** [default] Error 2
> make[2]: Leaving directory '/tmp/SBo/icecat-45.7.0/obj'
> /tmp/SBo/icecat-45.7.0/client.mk:396: recipe for target 'realbuild'
> failed
> make[1]: *** [realbuild] Error 2
> make[1]: Leaving directory '/tmp/SBo/icecat-45.7.0'
> client.mk:171: recipe for target 'build' failed
> make: *** [build] Error 2
-------------- next part --------------
A non-text attachment was scrubbed...
Name: signature.asc
Type: application/pgp-signature
Size: 819 bytes
Desc: This is a digitally signed message part.
URL: <http://lists.slackbuilds.org/pipermail/slackbuilds-users/attachments/20170427/aa357622/attachment.asc>

More information about the SlackBuilds-users mailing list