[Slackbuilds-users] Portmidi build fails

Terry tvbare at gmail.com
Mon Jun 26 19:47:39 UTC 2017

Trying to build portmidi fails with the following:

[ 85%] Building C object 
[ 87%] Building C object 
[ 90%] Building C object 
[ 92%] Linking C shared library ../Release/libportmidi.so
[ 92%] Built target portmidi-dynamic
Scanning dependencies of target pmdefaults_target
[ 95%] Generating pmdefaults/PmDefaults.class
/bin/sh: javac: command not found
pm_java/CMakeFiles/pmdefaults_target.dir/build.make:75: recipe for 
target 'pm_java/pmdefaults/PmDefaults.class' failed
make[2]: *** [pm_java/pmdefaults/PmDefaults.class] Error 127
CMakeFiles/Makefile2:562: recipe for target 
'pm_java/CMakeFiles/pmdefaults_target.dir/all' failed
make[1]: *** [pm_java/CMakeFiles/pmdefaults_target.dir/all] Error 2
Makefile:127: recipe for target 'all' failed
make: *** [all] Error 2

Can anyone shed some light on the error messages? Although I've used 
slack since
'95 with Slack 3.0, I'm a relative newbie to slackbuilds.

     Terry "Hoots"

          To stay young, never lose your sense of wonder.

              My main photo gallery can be seen at:

               I also keep a secondary gallery at:


More information about the SlackBuilds-users mailing list