[Slackbuilds-users] libtorrent-rasterbar build error on last Slackware-current?

Симонъ Болокановъ sbolokanov at abv.bg
Sun Sep 24 09:53:21 UTC 2017

 Anybody else having issues building libtorrent-rasterbar after last Slackware64-current update?  
  It seems issue is with boost. Any hints?
  In file included from ../include/libtorrent/version.hpp:36:0,

 from version.cpp:33:
../include/libtorrent/export.hpp:37:12: fatal error: boost/config/select_compiler_config.hpp: No such file or directory


compilation terminated.
make[1]: *** [Makefile:890: version.lo] Error 1
make[1]: Leaving directory '/tmp/SBo/libtorrent-rasterbar-1.0.11/src'
make: *** [Makefile:622: all-recursive] Error 1
-- Симонъ С. Болокановъ
-------------- next part --------------
An HTML attachment was scrubbed...
URL: <http://lists.slackbuilds.org/pipermail/slackbuilds-users/attachments/20170924/440d4128/attachment-0001.html>

More information about the SlackBuilds-users mailing list