[Slackbuilds-users] graphviz build failure

Nate Bargmann n0nb at n0nb.us
Thu May 24 12:09:18 UTC 2018

I'm not sure what kind of a conflict or lack of specified dependency on
Java exists with this package:

make  install-data-hook
make[7]: Entering directory '/tmp/SBo/graphviz-2.40.1/tclpkg/gv'
(cd /tmp/SBo/package-graphviz/usr/lib64/graphviz/java/org/graphviz; ln -s -f org/graphviz/libgv_java.so ../../libgv.so; javac -classpath /tmp/SBo/package-graphviz/usr/lib64/graphviz/java gv.java;)
/bin/sh: javac: command not found
make[7]: *** [install-data-hook] Error 127
Makefile:3723: recipe for target 'install-data-hook' failed
make[7]: Leaving directory '/tmp/SBo/graphviz-2.40.1/tclpkg/gv'
make[6]: *** [install-data-am] Error 2
Makefile:3428: recipe for target 'install-data-am' failed
make[6]: Leaving directory '/tmp/SBo/graphviz-2.40.1/tclpkg/gv'
make[5]: *** [install-am] Error 2
Makefile:3350: recipe for target 'install-am' failed
make[5]: Leaving directory '/tmp/SBo/graphviz-2.40.1/tclpkg/gv'
make[4]: *** [install-recursive] Error 1
Makefile:3187: recipe for target 'install-recursive' failed
make[4]: Leaving directory '/tmp/SBo/graphviz-2.40.1/tclpkg/gv'
make[3]: *** [install-recursive] Error 1
Makefile:648: recipe for target 'install-recursive' failed
make[3]: Leaving directory '/tmp/SBo/graphviz-2.40.1/tclpkg'
Makefile:822: recipe for target 'install-recursive' failed
make[2]: *** [install-recursive] Error 1
make[2]: Leaving directory '/tmp/SBo/graphviz-2.40.1'
make[1]: *** [install] Error 2
Makefile:1115: recipe for target 'install' failed
make[1]: Leaving directory '/tmp/SBo/graphviz-2.40.1'
make: *** [install-strip] Error 2
Makefile:1125: recipe for target 'install-strip' failed
Failure encountered while building graphviz:
  graphviz.SlackBuild return non-zero


- Nate


"The optimist proclaims that we live in the best of all
possible worlds.  The pessimist fears this is true."

Web: http://www.n0nb.us  GPG key: D55A8819  GitHub: N0NB
-------------- next part --------------
A non-text attachment was scrubbed...
Name: signature.asc
Type: application/pgp-signature
Size: 181 bytes
Desc: not available
URL: <http://lists.slackbuilds.org/pipermail/slackbuilds-users/attachments/20180524/a4baddcc/attachment-0001.asc>

More information about the SlackBuilds-users mailing list