[Slackbuilds-users] qt5 build fail

Tim Dickson dickson.tim at googlemail.com
Tue Apr 7 21:26:31 UTC 2020

trying to build the updated qt5  5.12.7 (using sbopkg) is failing for me.
with the error message.

ninja: build stopped: subcommand failed.
Makefile.gn_run:1237: recipe for target 'run_ninja' failed
make[4]: *** [run_ninja] Error 1
make[4]: Leaving directory 
Makefile:82: recipe for target 'sub-gn_run-pro-make_first' failed
make[3]: *** [sub-gn_run-pro-make_first] Error 2
make[3]: leaving directory 
Makefile:80: recipe for target 'sub-core-make_first' failed
make[2]: *** [sub-core-make_first] Error 2
make[2]: Leaving directory 
Makefile:48: recipe for target 'sub-src-make_first' failed
make[1]: *** [sub-arc-make_first] Error 2
make[1]: Leaving directory '/tmp/SBo/qt-everywhere-src-5.12.7/qtwebengine'
Makefile:1031: recipe for target 'module-qtwebengine-make_first' failed
make: *** [module-qtwebengine-make_first] Error 2

I do have Jinja installed
I am building with proprietry codecs and webengine options
Anyone any ideas
regards, Tim

This email has been checked for viruses by AVG.

More information about the SlackBuilds-users mailing list