[Slackbuilds-users] Updates - 20250111.1
Luveh Keraph
1.41421 at gmail.com
Sat Jan 11 22:21:48 UTC 2025
Trying to build the latest gnucash release I am getting the following:
[ 31%] Built target scm-engine-0
[ 31%] Generating ../../lib64/guile/3.0/site-ccache/gnucash/engine.go
wrote
`/tmp/SBo/gnucash-5.10/build/lib64/guile/3.0/site-ccache/gnucash/engine.go'
[ 31%] Built target scm-engine-1
[ 31%] Generating ../../share/guile/site/3.0/gnucash/utilities.scm
[ 31%] Built target scm-engine-2-links
[ 32%] Generating ../../lib64/guile/3.0/site-ccache/gnucash/utilities.go
utilities.scm:43:3: warning: possibly unbound variable `gnc-log-warn'
utilities.scm:46:3: warning: possibly unbound variable `gnc-log-error'
utilities.scm:49:3: warning: possibly unbound variable `gnc-log-msg'
utilities.scm:53:5: warning: possibly unbound variable `gnc-log-debug'
wrote
`/tmp/SBo/gnucash-5.10/build/lib64/guile/3.0/site-ccache/gnucash/utilities.go'
[ 32%] Built target scm-engine-2
[ 34%] Generating ../../lib64/guile/3.0/site-ccache/gnucash/options.go
Backtrace:
In ice-9/eval.scm:
619:8 19 (_ #(#(#<directory (guile-user) 7fd98f96cc80>)))
In /usr/bin/guild:
72:17 18 (main _)
In srfi/srfi-1.scm:
634:9 17 (for-each #<procedure 7fd98f8ee8c0 at scripts/compile.�> �)
In scripts/compile.scm:
279:26 16 (_ _)
In system/base/target.scm:
65:6 15 (with-target _ _)
In system/base/compile.scm:
187:6 14 (compile-file "/tmp/SBo/gnucash-5.10/bindings/guile/op�" �)
53:4 13 (call-with-output-file/atomic _ _ _)
In ice-9/boot-9.scm:
1752:10 12 (with-exception-handler _ _ #:unwind? _ # _)
In system/base/compile.scm:
69:11 11 (_)
190:11 10 (_ #<closed: file 7fd98f9cd930>)
331:39 9 (read-and-compile #<input: options.scm 13> #:from _ #:to �)
261:27 8 (_ _ _)
In ice-9/boot-9.scm:
2835:4 7 (save-module-excursion #<procedure 7fd98f910d60 at lang�>)
In language/scheme/compile-tree-il.scm:
31:15 6 (_)
In ice-9/psyntax.scm:
1230:36 5 (expand-top-sequence (#<syntax:options.scm:22:0 (#<sy�>) �)
1222:19 4 (parse _ (("placeholder" placeholder)) ((top) #(# # �)) �)
259:10 3 (parse _ (("placeholder" placeholder)) ((top) #(# # �)) �)
In unknown file:
2 (load-extension "libgnucash-guile" "scm_init_sw_app_uti�")
1 (dlsym #<pointer 0x16db950> "scm_init_sw_app_utils_modu�")
In ice-9/boot-9.scm:
1685:16 0 (raise-exception _ #:continuable? _)
ice-9/boot-9.scm:1685:16: In procedure raise-exception:
In procedure dlsym: Error resolving "scm_init_sw_app_utils_module":
"/usr/lib64/libgnucash-guile.so: undefined symbol:
scm_init_sw_app_utils_module"
make[2]: *** [bindings/guile/CMakeFiles/scm-options.dir/build.make:76:
lib64/guile/3.0/site-ccache/gnucash/options.go] Error 1
make[1]: *** [CMakeFiles/Makefile2:9716:
bindings/guile/CMakeFiles/scm-options.dir/all] Error 2
make: *** [Makefile:166: all] Error 2
Is it just me, or has anybody else out there observed this as well?
On Fri, Jan 10, 2025 at 6:50 PM Willy Sudiarto Raharjo <
willysr at slackbuilds.org> wrote:
> Sat Jan 11 01:44:22 UTC 2025
> academic/cdo: Updated for version 2.5.0.
> academic/nco: Updated for version 5.3.0.
> academic/units: Updated for version 2.24.
> academic/vul: Updated for version 20230314_10d9d61.
> desktop/SiriKali: Updated for version 1.8.0.
> desktop/numix-icon-theme-circle: Updated for version 24.12.12.
> desktop/numix-icon-theme: Updated for version 24.12.12.
> desktop/pcb2gcodeGUI: Added (GUI for pcb2gcode).
> development/actionlint: Updated for version 1.7.6.
> development/aws-cdk: Updated for version 2.174.0.
> development/aws-cdk: Updated for version 2.175.0.
> development/dart-sass: Updated for version 1.83.1.
> development/dkms: Include autoinstaller
> development/dpkg: Updated for version 1.22.13.
> development/jupyter-ipywidgets: Added (HTML widgets for Jupyter).
> development/jupyter-widgetsnbextension: Added (Interactive widget for
> Jupyter).
> development/meld3: Updated for version 3.22.3.
> development/mold: Updated for version 2.36.0.
> development/obsidian: updated for version 1.7.7
> development/php84: Added (Scripting Language).
> development/pnpm: Updated for version 9.15.3.
> development/protobuf3: Updated for version 29.3.
> games/attract: Added (Frontend for emulators).
> games/ddnet: updated for version 18.9.
> games/steamtinkerlaunch: New maintainer
> gis/eccodes: Updated for version 2.39.0.
> gis/gdal: Updated for version 3.10.0.
> gis/python3-xarray: Updated for version 2025.01.0
> graphics/paraview: Updated for version 5.13.2
> graphics/yacreader: Updated for version 9.15.0.
> libraries/pugixml: Updated for version 1.15.
> multimedia/QMPlay2: Updated for version 24.12.28.
> multimedia/aegisub: Updated for version 3.4.1.
> network/bitcoin: Updated for version 28.1.
> network/discord: Version bump to 0.0.79
> network/dropbox: Updated for version 215.4.7202.
> network/gallery-dl: Updated for version 1.28.3.
> network/netsniff-ng: Updated for version 0.6.9.
> network/newsraft: Updated for version 0.28.
> network/shadowsocks-rust: Updated for version 1.22.0.
> network/signal-desktop: Update for version 7.37.0.
> network/syncthingtray-bin: Updated for version 1.7.1.
> network/teamviewer: Updated for version 15.61.3.
> network/telegram: Updated for version 5.10.1.
> network/telegram: Updated for version 5.10.3.
> network/tor-browser: Updated for version 14.0.4.
> network/vivaldi: Updated for version 7.0.3495.29.
> network/wireshark: Updated for version 4.4.3.
> network/zoom-linux: Updated for 6.3.5.6065
> office/gnucash-docs: Updated for version 5.10.
> office/gnucash: Updated for version 5.10.
> office/pdfpc: Updated for version 4.7.0
> python/pyrfc3339: Updated for version 2.0.1.
> python/python3-aiohttp-socks: Updated for version 0.10.1.
> python/python3-anyio: Version bump to 4.8.0
> python/python3-cachecontrol: Version bump to 0.14.2
> python/python3-identify: Updated for version 2.6.5.
> python/python3-kiwisolver: Version bump to 1.4.8
> python/python3-poetry-dynamic-versioning: Updated for version 1.6.0.
> python/python3-socks: Updated for version 2.6.1.
> python/python3-soundfile: Version bump to 0.13.0
> python/python3-virtualenv: Version bump to 20.28.1
> python3/python3-poetry-dynamic-versioning: Updated for v 1.5.0.
> ruby/rbenv: Updated for version 1.3.2.
> system/CNS11643-kai-font: Updated for version 20241216.
> system/CNS11643-sung-font: Updated for version 20241216.
> system/bat: Updated for version 0.25.0.
> system/docker-compose: Updated for version 2.32.2
> system/fastfetch: Updated for version 2.34.0.
> system/jenkins: Updated for version 2.479.3.
> system/letsencrypt: Updated for version 3.1.0.
> system/netdata: Updated for version 2.1.1.
> system/sbokeeper: Updated for version 2.02.
> +--------------------------+
>
>
> --
> Willy Sudiarto Raharjo
>
> _______________________________________________
> SlackBuilds-users mailing list
> SlackBuilds-users at slackbuilds.org
> https://lists.slackbuilds.org/mailman/listinfo/slackbuilds-users
> Archives - https://lists.slackbuilds.org/pipermail/slackbuilds-users/
> FAQ - https://slackbuilds.org/faq/
>
>
-------------- next part --------------
An HTML attachment was scrubbed...
URL: <http://lists.slackbuilds.org/pipermail/slackbuilds-users/attachments/20250111/6729ad2a/attachment.htm>
More information about the SlackBuilds-users
mailing list