[Slackbuilds-users] libopenshot not building
Luveh Keraph
1.41421 at gmail.com
Sun Oct 4 17:22:08 UTC 2026
For a few weeks now libopenshot has been refusing to build for me:
-- The following features have been disabled:
* Coverage, analyze test coverage and generate report
* IWYU (include-what-you-use), Scan all source files with 'iwyu'
* Wayland screen capture, Use the optional xdg-desktop-portal and PipeWire
capture module
-- The following OPTIONAL packages have not been found:
* Resvg
-- Configuring done
-- Generating done
-- Build files have been written to: /tmp/SBo/libopenshot-1.0.1/build
[ 1%] Running cpp protocol buffer compiler on trackerdata.proto
/usr/bin/protoc: error while loading shared libraries:
libabsl_die_if_null.so.2508.0.0: cannot open shared object file: No such
file or directory
make[2]: *** [src/CMakeFiles/openshot_autogen.dir/build.make:97:
src/trackerdata.pb.h] Error 127
make[1]: *** [CMakeFiles/Makefile2:2929:
src/CMakeFiles/openshot_autogen.dir/all] Error 2
make: *** [Makefile:166: all] Error 2
I have all the required packages installed, and there is no libasl* shared
library in any of them, or anywhere else in the system, at that.
-------------- next part --------------
An HTML attachment was scrubbed...
URL: <http://lists.slackbuilds.org/pipermail/slackbuilds-users/attachments/20261004/77faed41/attachment-0001.htm>
More information about the SlackBuilds-users
mailing list