[Slackbuilds-users] epdfview Build Problem

Rich Shepard rshepard at appl-ecosys.com
Thu Jun 16 20:22:09 UTC 2011

   Working with a 64-bit system is new to me so I'm hitting issues that I
expect will go away with experience. I installed AlienBob's multilibs and
compat32 libraries this morning and I'm trying to get every application I
might need on the machine before I leave on a business trip this Sunday.

   The current problem is with epdview. Running the SlackBuild script

In file included from /usr/include/glib-2.0/glib/gasyncqueue.h:34:0,
                  from /usr/include/glib-2.0/glib.h:34,
                  from /usr/include/glib-2.0/gobject/gbinding.h:30,
                  from /usr/include/glib-2.0/glib-object.h:25,
                  from /usr/include/glib-2.0/gio/gioenums.h:30,
                  from /usr/include/glib-2.0/gio/giotypes.h:30,
                  from /usr/include/glib-2.0/gio/gio.h:28,
                  from /usr/include/gtk-2.0/gdk/gdkapplaunchcontext.h:30,
                  from /usr/include/gtk-2.0/gdk/gdk.h:32,
                  from /usr/include/gtk-2.0/gtk/gtk.h:32,
                  from FindView.cxx:21:
/usr/include/glib-2.0/glib/gthread.h: In function 'gboolean
g_once_init_enter  olatile gsize*)':
/usr/include/glib-2.0/glib/gthread.h:347:6: error: size of array is negative
make[3]: *** [libshell_gtk_a-FindView.o] Error 1
make[3]: Leaving directory /tmp/SBo/epdfview-0.1.7/src/gtk'
make[2]: *** [all-recursive] Error 1
make[2]: Leaving directory /tmp/SBo/epdfview-0.1.7/src'
make[1]: *** [all-recursive] Error 1
make[1]: Leaving directory /tmp/SBo/epdfview-0.1.7'
make: *** [all] Error 2

   This, along with the GoogleEarth issue, suggests to me that either the
multilib upgrades or the compat32 installations are incomplete. Yesterday I
downloaded all 210M of the 13.37/ subdirectory and this morning followed the
web page "Quick Start" instructions step-by-step.

   What's your recommendations to find and fix these problems?


More information about the SlackBuilds-users mailing list