[Slackbuilds-users] Graphviz Build Error

Rich Shepard rshepard at appl-ecosys.com
Thu Jun 16 21:16:20 UTC 2011

   If I have missed something with the installation of the multilib and
compat32 libraries, how should I re-do the process to fix the errors?

   Graphviz tells me it cannot find a library which is in /usr/lib64; it's
looking in /usr/lib. Is this a build script error?

libtool: link: warning: /usr/lib/libstdc++.la' seems to be moved
/usr/lib/libpangocairo-1.0.so: could not read symbols: File in wrong format
collect2: ld returned 1 exit status
make[3]: *** [libgvplugin_gd.la] Error 1
make[3]: Leaving directory /tmp/SBo/graphviz-2.28.0/plugin/gd'
make[2]: *** [all-recursive] Error 1
make[2]: Leaving directory /tmp/SBo/graphviz-2.28.0/plugin'
make[1]: *** [all-recursive] Error 1
make[1]: Leaving directory /tmp/SBo/graphviz-2.28.0'
make: *** [all] Error 2


More information about the SlackBuilds-users mailing list