[Slackbuilds-users] My stuff in Checklist.txt

Robby Workman rworkman at slackbuilds.org
Fri Sep 21 04:35:59 UTC 2012

On Thu, 20 Sep 2012 12:07:24 -0400
B Watson <yalhcru at gmail.com> wrote:

> games/sdlmess - Remove. It's outdated and unmaintained, now that the
> main MESS source builds on Linux. I'll submit a mess.SlackBuild after
> submissions are open again.


> audio/sooperlooper - This built fine for me. The only issue was
> the REQUIRES line mentioned "libsigc++-legacy", which should be
> "libsigc++-legacy12" (patch attached). Is this the only reason it was
> in the Checklist?

Here's what's in the error log:

make[3]: Entering directory `/tmp/sbopkg.HAVWV7/sooperlooper-1.6.14/src'
if g++ -DHAVE_CONFIG_H -I. -I. -I..    -I/usr/lib64/sigc++-1.2/include -I/usr/include/sigc++-1.2       -I/usr/include/libxml2      -O2 -fPIC -
D_REENTRANT -Os -fomit-frame-pointer -mmmx -msse -mfpmath=sse -pipe -Wall -D_LARGEFILE_SOURCE -D_LARGEFILE64_SOURCE -I/tmp/sbopkg.HAVWV7/soope
rlooper-1.6.14/libs/pbd -I/tmp/sbopkg.HAVWV7/sooperlooper-1.6.14/libs/midi++ -MT engine.o -MD -MP -MF ".deps/engine.Tpo" -c -o engine.o engine
.cpp; \
then mv -f ".deps/engine.Tpo" ".deps/engine.Po"; else rm -f ".deps/engine.Tpo"; exit 1; fi
engine.cpp: In member function 'int SooperLooper::Engine::generate_sync(SooperLooper::nframes_t, SooperLooper::nframes_t)':
engine.cpp:2459:13: warning: variable 'fragpos' set but not used [-Wunused-but-set-variable]
engine.cpp:2460:21: warning: variable 'timestamp' set but not used [-Wunused-but-set-variable]
if g++ -DHAVE_CONFIG_H -I. -I. -I..    -I/usr/lib64/sigc++-1.2/include -I/usr/include/sigc++-1.2       -I/usr/include/libxml2      -O2 -fPIC -
D_REENTRANT -Os -fomit-frame-pointer -mmmx -msse -mfpmath=sse -pipe -Wall -D_LARGEFILE_SOURCE -D_LARGEFILE64_SOURCE -I/tmp/sbopkg.HAVWV7/soope
rlooper-1.6.14/libs/pbd -I/tmp/sbopkg.HAVWV7/sooperlooper-1.6.14/libs/midi++ -MT control_osc.o -MD -MP -MF ".deps/control_osc.Tpo" -c -o contr
ol_osc.o control_osc.cpp; \
then mv -f ".deps/control_osc.Tpo" ".deps/control_osc.Po"; else rm -f ".deps/control_osc.Tpo"; exit 1; fi
if g++ -DHAVE_CONFIG_H -I. -I. -I..    -I/usr/lib64/sigc++-1.2/include -I/usr/include/sigc++-1.2       -I/usr/include/libxml2      -O2 -fPIC -
D_REENTRANT -Os -fomit-frame-pointer -mmmx -msse -mfpmath=sse -pipe -Wall -D_LARGEFILE_SOURCE -D_LARGEFILE64_SOURCE -I/tmp/sbopkg.HAVWV7/soope
rlooper-1.6.14/libs/pbd -I/tmp/sbopkg.HAVWV7/sooperlooper-1.6.14/libs/midi++ -MT looper.o -MD -MP -MF ".deps/looper.Tpo" -c -o looper.o looper
.cpp; \
then mv -f ".deps/looper.Tpo" ".deps/looper.Po"; else rm -f ".deps/looper.Tpo"; exit 1; fi
looper.cpp:39:44: fatal error: rubberband/RubberBandStretcher.h: No such file or directory
compilation terminated.
make[3]: *** [looper.o] Error 1
make[3]: Leaving directory `/tmp/sbopkg.HAVWV7/sooperlooper-1.6.14/src'
make[2]: *** [all-recursive] Error 1
make[2]: Leaving directory `/tmp/sbopkg.HAVWV7/sooperlooper-1.6.14/src'
make[1]: *** [all-recursive] Error 1
make[1]: Leaving directory `/tmp/sbopkg.HAVWV7/sooperlooper-1.6.14'
make: *** [all] Error 2

> games/typhoon_2001 - Download URL went away, found a mirrored copy.
> Other than the .info file, no changes. Patch attached.

ponce got this one.

> games/skulltag - Can't find anything wrong with this. It's a binary
> repackage, so obviously it "builds" fine. The binary runs OK... why
> was it in Checklist?

Dunno, and it's gone now.  I don't see an error log for it either;
maybe it was one of those on the short list of what didn't actually
get tested here.

> multimedia/nted - Builds fine for me. Any idea why it was in the
> Checklist?

No idea.  Identical to above.

> audio/wineasio - This builds fine for me once I add the asio.h from
> the proprietary ASIO SDK (see the README). Might have just been in
> the Checklist because the tester didn't have the time/energy/desire
> to register as an official developer with Steinberg. Hint: a couple of
> projects with public cvs/svn/etc repos might have accidentally checked
> asio.h into their trees...

Well, if someone finds it and sends a patch to add that link to the
.info file, someone else might apply it.  :-)

> These needed various fixes to get them to build:
> audio/jack-rack
> audio/qm-vamp-plugins
> audio/sonic-visualiser
> audio/tap_plugins
> audio/transcribe
> games/chocolate-doom
> games/liquidwar6
> games/oblige
> games/odamex
> In a couple cases, I updated to newer versions rather than waste time
> patching the old ones. Patches attached.

ponce already got oblige.  I'll look at these others now.

-------------- next part --------------
A non-text attachment was scrubbed...
Name: signature.asc
Type: application/pgp-signature
Size: 198 bytes
Desc: not available
URL: <http://lists.slackbuilds.org/pipermail/slackbuilds-users/attachments/20120920/9236d64a/attachment-0001.asc>

More information about the SlackBuilds-users mailing list