[Slackbuilds-users] atom build failure

Miguel De Anda miguel at thedeanda.com
Sat Jan 31 17:31:00 UTC 2015

i'm building from current with multilib but it only claims node is needed.
any ideas? virtualbox has been crashing my system lately so its hard to
test from non-current and non-multilib.


../node_modules/nan/nan.h: In function 'void
../node_modules/nan/nan.h:222:5: error: 'ContextDisposedNotification' is
not a member of 'v8::V8'
make: *** [Release/obj.target/spellchecker/src/main.o] Error 1
gyp ERR! build error
gyp ERR! stack Error: `make` failed with exit code: 2
gyp ERR! stack     at ChildProcess.onExit
gyp ERR! stack     at ChildProcess.emit (events.js:98:17)
gyp ERR! stack     at Process.ChildProcess._handle.onexit
gyp ERR! System Linux 3.14.29
gyp ERR! command "node"
gyp ERR! cwd
gyp ERR! node -v v0.10.32
gyp ERR! node-gyp -v v0.12.2
gyp ERR! not ok
npm ERR! spellchecker at 1.1.0 install: `node-gyp rebuild`
npm ERR! Exit status 1
npm ERR!
npm ERR! Failed at the spellchecker at 1.1.0 install script.
npm ERR! This is most likely a problem with the spellchecker package,
npm ERR! not with npm itself.
npm ERR! Tell the author that this fails on your system:
npm ERR!     node-gyp rebuild
npm ERR! You can get their info via:
npm ERR!     npm owner ls spellchecker
npm ERR! There is likely additional logging output above.

npm ERR! System Linux 3.14.29
npm ERR! command
"--userconfig" "/root/.atom/.apmrc" "install"
"/mnt/sdb1/tmp/d-115031-17975-11cvpze/package.tgz" "--target=0.18.0"
"--arch=x64" "--quiet"
npm ERR! cwd /mnt/sdb1/sbopkg/tmp/atom-0.138.0
npm ERR! node -v v0.10.32
npm ERR! npm -v 1.4.4
npm ERR!
npm ERR! Additional logging details can be found in:
npm ERR!     /mnt/sdb1/sbopkg/tmp/atom-0.138.0/npm-debug.log
npm ERR! not ok code 0
-------------- next part --------------
An HTML attachment was scrubbed...
URL: <http://lists.slackbuilds.org/pipermail/slackbuilds-users/attachments/20150131/51a84694/attachment.html>

More information about the SlackBuilds-users mailing list