[Slackbuilds-users] Scribus-1.4.6: build fails not finding freetype.h

Rich Shepard rshepard at appl-ecosys.com
Mon Aug 7 17:46:40 UTC 2017

On Mon, 7 Aug 2017, Andreas Guldstrand wrote:

> The line before the line you added needs to end in a \ as well

   Fixed that. Now, back to the previous error:

In file included from
/tmp/SBo/scribus-1.4.6/scribus/scfonts.h:19:23: fatal error: freetype.h: No
such file or directory
  #include FT_FREETYPE_H
compilation terminated.
make[2]: ***
[scribus/desaxe/CMakeFiles/scribus_desaxe_lib.dir/saxiohelper.cpp.o] Error 1
make[2]: Leaving directory /tmp/SBo/scribus-1.4.6'
make[1]: *** [scribus/desaxe/CMakeFiles/scribus_desaxe_lib.dir/all] Error 2
make[1]: Leaving directory /tmp/SBo/scribus-1.4.6'
make: *** [all] Error 2

   For some reason not worth pursuing any longer (since scribus builds and
works with freetype-2.6.3), it just won't build with freetype-2.5.5 on this


More information about the SlackBuilds-users mailing list