[Slackbuilds-users] GunCash-2.6.15 build fails

Rich Shepard rshepard at appl-ecosys.com
Thu Jan 5 16:28:50 UTC 2017

   Yesterday I tried to build gnucash-2.6.15 after changing the version
number in the 2.6.13 script; the attempt fails:

../../src/register/ledger-core/.libs/libgncmod-ledger-core.so: undefined 
to `gnc_recn_cell_set_read_only'
collect2: error: ld returned 1 exit status
make[4]: *** [gnucash] Error 1
make[4]: Leaving directory /tmp/SBo/gnucash-2.6.15/src/bin'
make[3]: *** [all-recursive] Error 1
make[3]: Leaving directory /tmp/SBo/gnucash-2.6.15/src/bin'
make[2]: *** [all-recursive] Error 1
make[2]: Leaving directory /tmp/SBo/gnucash-2.6.15/src'
make[1]: *** [all-recursive] Error 1
make[1]: Leaving directory /tmp/SBo/gnucash-2.6.15'
make: *** [all] Error 2

   Please advise me how to remedy this condition so I can upgrade to the
latest version.



More information about the SlackBuilds-users mailing list