[Slackbuilds-users] VTK not compiling =\

Fernando Lopez fernando.lopezjr at gmail.com
Mon Jul 31 03:34:04 UTC 2017

is it just me?


Scanning dependencies of target QVTKWidgetPlugin
[ 37%] Building CXX object
[ 37%] Building CXX object
[ 37%] Linking CXX shared library ../../lib64/libQVTKWidgetPlugin.so
[ 37%] Built target QVTKWidgetPlugin
[ 37%] Generating moc_vtkQtTreeModelAdapter.cxx
/tmp/SBo/VTK-8.0.0/GUISupport/Qt/vtkQtTreeModelAdapter.h:52: Parse error at
GUISupport/Qt/CMakeFiles/vtkGUISupportQt.dir/build.make:117: recipe for
target 'GUISupport/Qt/moc_vtkQtTreeModelAdapter.cxx' failed
make[2]: *** [GUISupport/Qt/moc_vtkQtTreeModelAdapter.cxx] Error 1
CMakeFiles/Makefile2:7445: recipe for target
'GUISupport/Qt/CMakeFiles/vtkGUISupportQt.dir/all' failed
make[1]: *** [GUISupport/Qt/CMakeFiles/vtkGUISupportQt.dir/all] Error 2
Makefile:127: recipe for target 'all' failed
make: *** [all] Error 2

Would you like to continue processing the rest of the
queue or would you like to abort?  If this failed
package is a dependency of another package in the queue
then it may not make sense to continue.

(Y)es to continue, (N)o to abort, (R)etry the build?:


    Fernando Lopez Jr.
-------------- next part --------------
An HTML attachment was scrubbed...
URL: <http://lists.slackbuilds.org/pipermail/slackbuilds-users/attachments/20170730/7c376796/attachment-0001.html>

More information about the SlackBuilds-users mailing list