[Slackbuilds-users] gwyddion 2.46 requires libminizip

Fellype do Nascimento fellype at gmail.com
Mon Oct 17 14:06:10 UTC 2016

Hi all,

libminizip is currently assigned as an optional dependence of gwyddion. 
But when upgrading gwyddion 2.45 -> 2.46 I got the following error(s):

jpkscan.c: In function 'match_segment_filename':
jpkscan.c:804:11: error: implicit declaration of function 'atoi' 
      *id = atoi(s);
cc1: some warnings being treated as errors
make[3]: *** [jpkscan_la-jpkscan.lo] Error 1
Makefile:1972: recipe for target 'jpkscan_la-jpkscan.lo' failed
make[3]: Leaving directory '/tmp/SBo/gwyddion-2.46/modules/file'
make[2]: *** [all-recursive] Error 1
Makefile:642: recipe for target 'all-recursive' failed
make[2]: Leaving directory '/tmp/SBo/gwyddion-2.46/modules'
make[1]: *** [all-recursive] Error 1
Makefile:612: recipe for target 'all-recursive' failed
make[1]: Leaving directory '/tmp/SBo/gwyddion-2.46'
make: *** [all] Error 2
Makefile:521: recipe for target 'all' failed
   gwyddion: gwyddion.SlackBuild return non-zero

gwyddion 2.46 compiled fine after installing libminizip.



Dr. Fellype do Nascimento - fellype (at) gmail.com
Center for Semiconductor Components and Nanotechnologies / Laboratório de Plasmas
State University of Campinas, C.P. 6101,
Rua João Pandia Calogeras, No.90,
Cidade Universitária Zeferino Vaz,
Campinas, SP, 13083-870, Brazil
Fone/Phone: +55 19 35217321

More information about the SlackBuilds-users mailing list